Console Output

Started by upstream project "DSL5_dnet-core-components-saxonHE" build number 23
originally caused by:
 Started by user alessia.bardi
[EnvInject] - Loading node environment variables.
Building remotely on ip-90-147-167-168.ct1.garrservices.it (slave-1-garr) in workspace /var/lib/jenkins/workspace/DSL5_dnet-graph-domain-saxonHE
Updating http://svn-public.driver.research-infrastructures.eu/driver/dnet50/modules/dnet-graph-domain/branches/saxonHE at revision '2017-09-20T17:08:30.988 +0200'
At revision 49022

No changes for http://svn-public.driver.research-infrastructures.eu/driver/dnet50/modules/dnet-graph-domain/branches/saxonHE since the previous build
Parsing POMs
Failed to transfer Could not find metadata eu.dnetlib:dnet-parent:2.0.0-SNAPSHOT/maven-metadata.xml in dnet45-bootstrap-snapshot (http://maven.research-infrastructures.eu/nexus/content/repositories/dnet45-bootstrap-snapshot/)
Downloaded artifact http://maven.research-infrastructures.eu/nexus/content/repositories/dnet5-bootstrap-snapshot/eu/dnetlib/dnet-parent/2.0.0-SNAPSHOT/maven-metadata.xml
Failed to transfer Could not find metadata eu.dnetlib:dnet-parent:2.0.0-SNAPSHOT/maven-metadata.xml in dnet5-snapshots (http://maven.research-infrastructures.eu/nexus/content/repositories/dnet5-snapshots)
Failed to transfer Could not find metadata eu.dnetlib:dnet-parent:2.0.0-SNAPSHOT/maven-metadata.xml in dnet-deps (http://maven.research-infrastructures.eu/nexus/content/repositories/dnet-deps)
Established TCP socket on 50471
maven33-agent.jar already up to date
maven33-interceptor.jar already up to date
maven3-interceptor-commons.jar already up to date
[DSL5_dnet-graph-domain-saxonHE] $ java -cp /var/lib/jenkins/maven33-agent.jar:/var/lib/jenkins/tools/hudson.tasks.Maven_MavenInstallation/maven/boot/plexus-classworlds-2.5.2.jar:/var/lib/jenkins/tools/hudson.tasks.Maven_MavenInstallation/maven/conf/logging jenkins.maven3.agent.Maven33Main /var/lib/jenkins/tools/hudson.tasks.Maven_MavenInstallation/maven /var/lib/jenkins/slave.jar /var/lib/jenkins/maven33-interceptor.jar /var/lib/jenkins/maven3-interceptor-commons.jar 50471
<===[JENKINS REMOTING CAPACITY]===>channel started
Executing Maven:  -B -f /var/lib/jenkins/workspace/DSL5_dnet-graph-domain-saxonHE/pom.xml package -U source:jar
[INFO] Scanning for projects...
[INFO] Downloading: http://maven.research-infrastructures.eu/nexus/content/repositories/dnet5-bootstrap-snapshot/eu/dnetlib/dnet-parent/2.0.0-SNAPSHOT/maven-metadata.xml
[INFO] Downloading: http://maven.research-infrastructures.eu/nexus/content/repositories/dnet45-bootstrap-snapshot/eu/dnetlib/dnet-parent/2.0.0-SNAPSHOT/maven-metadata.xml
[INFO] Downloaded: http://maven.research-infrastructures.eu/nexus/content/repositories/dnet5-bootstrap-snapshot/eu/dnetlib/dnet-parent/2.0.0-SNAPSHOT/maven-metadata.xml (598 B at 2.4 KB/sec)
[INFO] Downloading: http://maven.research-infrastructures.eu/nexus/content/repositories/dnet-deps/eu/dnetlib/dnet-parent/2.0.0-SNAPSHOT/maven-metadata.xml
[INFO] Downloading: http://maven.research-infrastructures.eu/nexus/content/repositories/dnet5-snapshots/eu/dnetlib/dnet-parent/2.0.0-SNAPSHOT/maven-metadata.xml
[INFO]                                                                         
[INFO] ------------------------------------------------------------------------
[INFO] Building dnet-graph-domain 1.0.0-SAXONHE-SNAPSHOT
[INFO] ------------------------------------------------------------------------
[INFO] Downloading: http://maven.research-infrastructures.eu/nexus/content/repositories/dnet5-bootstrap-snapshot/eu/dnetlib/protoc-jar-maven-plugin/1.0.0-SNAPSHOT/maven-metadata.xml
[INFO] Downloaded: http://maven.research-infrastructures.eu/nexus/content/repositories/dnet5-bootstrap-snapshot/eu/dnetlib/protoc-jar-maven-plugin/1.0.0-SNAPSHOT/maven-metadata.xml (2 KB at 0.7 KB/sec)
[INFO] Downloading: http://maven.research-infrastructures.eu/nexus/content/repositories/dnet45-bootstrap-snapshot/eu/dnetlib/dnet-pace-core/2.5.0-SNAPSHOT/maven-metadata.xml
[INFO] Downloading: http://maven.research-infrastructures.eu/nexus/content/repositories/dnet-deps/eu/dnetlib/dnet-pace-core/2.5.0-SNAPSHOT/maven-metadata.xml
[INFO] Downloading: http://maven.research-infrastructures.eu/nexus/content/repositories/dnet5-bootstrap-snapshot/eu/dnetlib/dnet-pace-core/2.5.0-SNAPSHOT/maven-metadata.xml
[INFO] Downloading: http://maven.research-infrastructures.eu/nexus/content/repositories/dnet5-snapshots/eu/dnetlib/dnet-pace-core/2.5.0-SNAPSHOT/maven-metadata.xml
[INFO] Downloaded: http://maven.research-infrastructures.eu/nexus/content/repositories/dnet5-snapshots/eu/dnetlib/dnet-pace-core/2.5.0-SNAPSHOT/maven-metadata.xml (988 B at 2.1 KB/sec)
[INFO] Downloading: http://maven.research-infrastructures.eu/nexus/content/repositories/dnet45-bootstrap-release/log4j/log4j/maven-metadata.xml
[INFO] Downloading: http://maven.research-infrastructures.eu/nexus/content/repositories/dnet5-bootstrap-snapshot/log4j/log4j/maven-metadata.xml
[INFO] Downloading: http://maven.research-infrastructures.eu/nexus/content/repositories/dnet45-bootstrap-snapshot/log4j/log4j/maven-metadata.xml
[INFO] Downloading: http://maven.research-infrastructures.eu/nexus/content/repositories/dnet5-bootstrap-release/log4j/log4j/maven-metadata.xml
[INFO] Downloading: http://maven.research-infrastructures.eu/nexus/content/repositories/dnet-deps/log4j/log4j/maven-metadata.xml
[INFO] Downloading: http://maven.research-infrastructures.eu/nexus/content/repositories/dnet5-snapshots/log4j/log4j/maven-metadata.xml
[INFO] Downloading: http://maven.research-infrastructures.eu/nexus/content/repositories/dnet5-releases/log4j/log4j/maven-metadata.xml
[INFO] Downloading: https://repo.maven.apache.org/maven2/log4j/log4j/maven-metadata.xml
[INFO] Downloaded: http://maven.research-infrastructures.eu/nexus/content/repositories/dnet-deps/log4j/log4j/maven-metadata.xml (322 B at 4.0 KB/sec)
[INFO] Downloaded: https://repo.maven.apache.org/maven2/log4j/log4j/maven-metadata.xml (750 B at 1.8 KB/sec)
[INFO] Downloading: http://maven.research-infrastructures.eu/nexus/content/repositories/dnet45-bootstrap-snapshot/eu/dnetlib/dnet-core-components/2.0.0-SAXONHE-SNAPSHOT/maven-metadata.xml
[INFO] Downloading: http://maven.research-infrastructures.eu/nexus/content/repositories/dnet-deps/eu/dnetlib/dnet-core-components/2.0.0-SAXONHE-SNAPSHOT/maven-metadata.xml
[INFO] Downloading: http://maven.research-infrastructures.eu/nexus/content/repositories/dnet5-bootstrap-snapshot/eu/dnetlib/dnet-core-components/2.0.0-SAXONHE-SNAPSHOT/maven-metadata.xml
[INFO] Downloading: http://maven.research-infrastructures.eu/nexus/content/repositories/dnet5-snapshots/eu/dnetlib/dnet-core-components/2.0.0-SAXONHE-SNAPSHOT/maven-metadata.xml
[INFO] Downloaded: http://maven.research-infrastructures.eu/nexus/content/repositories/dnet5-snapshots/eu/dnetlib/dnet-core-components/2.0.0-SAXONHE-SNAPSHOT/maven-metadata.xml (2 KB at 9.3 KB/sec)
[INFO] Downloading: http://maven.research-infrastructures.eu/nexus/content/repositories/dnet45-bootstrap-snapshot/org/springframework/spring-webmvc/maven-metadata.xml
[INFO] Downloading: http://maven.research-infrastructures.eu/nexus/content/repositories/dnet45-bootstrap-release/org/springframework/spring-webmvc/maven-metadata.xml
[INFO] Downloading: http://maven.research-infrastructures.eu/nexus/content/repositories/dnet5-bootstrap-snapshot/org/springframework/spring-webmvc/maven-metadata.xml
[INFO] Downloading: http://maven.research-infrastructures.eu/nexus/content/repositories/dnet5-bootstrap-release/org/springframework/spring-webmvc/maven-metadata.xml
[INFO] Downloading: http://maven.research-infrastructures.eu/nexus/content/repositories/dnet-deps/org/springframework/spring-webmvc/maven-metadata.xml
[INFO] Downloading: http://maven.research-infrastructures.eu/nexus/content/repositories/dnet5-snapshots/org/springframework/spring-webmvc/maven-metadata.xml
[INFO] Downloading: http://maven.research-infrastructures.eu/nexus/content/repositories/dnet5-releases/org/springframework/spring-webmvc/maven-metadata.xml
[INFO] Downloading: https://repo.maven.apache.org/maven2/org/springframework/spring-webmvc/maven-metadata.xml
[INFO] Downloaded: https://repo.maven.apache.org/maven2/org/springframework/spring-webmvc/maven-metadata.xml (5 KB at 56.5 KB/sec)
[INFO] Downloading: http://maven.research-infrastructures.eu/nexus/content/repositories/dnet45-bootstrap-release/org/springframework/spring-context/maven-metadata.xml
[INFO] Downloading: http://maven.research-infrastructures.eu/nexus/content/repositories/dnet45-bootstrap-snapshot/org/springframework/spring-context/maven-metadata.xml
[INFO] Downloading: http://maven.research-infrastructures.eu/nexus/content/repositories/dnet5-bootstrap-snapshot/org/springframework/spring-context/maven-metadata.xml
[INFO] Downloading: http://maven.research-infrastructures.eu/nexus/content/repositories/dnet5-bootstrap-release/org/springframework/spring-context/maven-metadata.xml
[INFO] Downloading: http://maven.research-infrastructures.eu/nexus/content/repositories/dnet-deps/org/springframework/spring-context/maven-metadata.xml
[INFO] Downloading: http://maven.research-infrastructures.eu/nexus/content/repositories/dnet5-snapshots/org/springframework/spring-context/maven-metadata.xml
[INFO] Downloading: http://maven.research-infrastructures.eu/nexus/content/repositories/dnet5-releases/org/springframework/spring-context/maven-metadata.xml
[INFO] Downloading: https://repo.maven.apache.org/maven2/org/springframework/spring-context/maven-metadata.xml
[INFO] Downloaded: https://repo.maven.apache.org/maven2/org/springframework/spring-context/maven-metadata.xml (5 KB at 55.2 KB/sec)
[INFO] Downloading: http://maven.research-infrastructures.eu/nexus/content/repositories/dnet45-bootstrap-release/org/springframework/spring-beans/maven-metadata.xml
[INFO] Downloading: http://maven.research-infrastructures.eu/nexus/content/repositories/dnet45-bootstrap-snapshot/org/springframework/spring-beans/maven-metadata.xml
[INFO] Downloading: http://maven.research-infrastructures.eu/nexus/content/repositories/dnet5-bootstrap-snapshot/org/springframework/spring-beans/maven-metadata.xml
[INFO] Downloading: http://maven.research-infrastructures.eu/nexus/content/repositories/dnet5-bootstrap-release/org/springframework/spring-beans/maven-metadata.xml
[INFO] Downloading: http://maven.research-infrastructures.eu/nexus/content/repositories/dnet5-snapshots/org/springframework/spring-beans/maven-metadata.xml
[INFO] Downloading: http://maven.research-infrastructures.eu/nexus/content/repositories/dnet5-releases/org/springframework/spring-beans/maven-metadata.xml
[INFO] Downloading: http://maven.research-infrastructures.eu/nexus/content/repositories/dnet-deps/org/springframework/spring-beans/maven-metadata.xml
[INFO] Downloading: https://repo.maven.apache.org/maven2/org/springframework/spring-beans/maven-metadata.xml
[INFO] Downloaded: https://repo.maven.apache.org/maven2/org/springframework/spring-beans/maven-metadata.xml (5 KB at 49.8 KB/sec)
[INFO] Downloading: http://maven.research-infrastructures.eu/nexus/content/repositories/dnet45-bootstrap-release/org/springframework/spring-context-support/maven-metadata.xml
[INFO] Downloading: http://maven.research-infrastructures.eu/nexus/content/repositories/dnet45-bootstrap-snapshot/org/springframework/spring-context-support/maven-metadata.xml
[INFO] Downloading: http://maven.research-infrastructures.eu/nexus/content/repositories/dnet5-bootstrap-release/org/springframework/spring-context-support/maven-metadata.xml
[INFO] Downloading: http://maven.research-infrastructures.eu/nexus/content/repositories/dnet5-bootstrap-snapshot/org/springframework/spring-context-support/maven-metadata.xml
[INFO] Downloading: http://maven.research-infrastructures.eu/nexus/content/repositories/dnet-deps/org/springframework/spring-context-support/maven-metadata.xml
[INFO] Downloading: http://maven.research-infrastructures.eu/nexus/content/repositories/dnet5-snapshots/org/springframework/spring-context-support/maven-metadata.xml
[INFO] Downloading: http://maven.research-infrastructures.eu/nexus/content/repositories/dnet5-releases/org/springframework/spring-context-support/maven-metadata.xml
[INFO] Downloading: https://repo.maven.apache.org/maven2/org/springframework/spring-context-support/maven-metadata.xml
[INFO] Downloaded: https://repo.maven.apache.org/maven2/org/springframework/spring-context-support/maven-metadata.xml (4 KB at 44.2 KB/sec)
[INFO] Downloading: http://maven.research-infrastructures.eu/nexus/content/repositories/dnet45-bootstrap-snapshot/net/sf/ehcache/ehcache-core/maven-metadata.xml
[INFO] Downloading: http://maven.research-infrastructures.eu/nexus/content/repositories/dnet5-bootstrap-snapshot/net/sf/ehcache/ehcache-core/maven-metadata.xml
[INFO] Downloading: http://maven.research-infrastructures.eu/nexus/content/repositories/dnet45-bootstrap-release/net/sf/ehcache/ehcache-core/maven-metadata.xml
[INFO] Downloading: http://maven.research-infrastructures.eu/nexus/content/repositories/dnet5-bootstrap-release/net/sf/ehcache/ehcache-core/maven-metadata.xml
[INFO] Downloading: http://maven.research-infrastructures.eu/nexus/content/repositories/dnet-deps/net/sf/ehcache/ehcache-core/maven-metadata.xml
[INFO] Downloading: http://maven.research-infrastructures.eu/nexus/content/repositories/dnet5-snapshots/net/sf/ehcache/ehcache-core/maven-metadata.xml
[INFO] Downloading: http://maven.research-infrastructures.eu/nexus/content/repositories/dnet5-releases/net/sf/ehcache/ehcache-core/maven-metadata.xml
[INFO] Downloading: https://repo.maven.apache.org/maven2/net/sf/ehcache/ehcache-core/maven-metadata.xml
[INFO] Downloaded: https://repo.maven.apache.org/maven2/net/sf/ehcache/ehcache-core/maven-metadata.xml (2 KB at 20.1 KB/sec)
[INFO] Downloading: http://maven.research-infrastructures.eu/nexus/content/repositories/dnet45-bootstrap-snapshot/org/antlr/stringtemplate/maven-metadata.xml
[INFO] Downloading: http://maven.research-infrastructures.eu/nexus/content/repositories/dnet45-bootstrap-release/org/antlr/stringtemplate/maven-metadata.xml
[INFO] Downloading: http://maven.research-infrastructures.eu/nexus/content/repositories/dnet5-bootstrap-snapshot/org/antlr/stringtemplate/maven-metadata.xml
[INFO] Downloading: http://maven.research-infrastructures.eu/nexus/content/repositories/dnet5-bootstrap-release/org/antlr/stringtemplate/maven-metadata.xml
[INFO] Downloading: http://maven.research-infrastructures.eu/nexus/content/repositories/dnet-deps/org/antlr/stringtemplate/maven-metadata.xml
[INFO] Downloading: http://maven.research-infrastructures.eu/nexus/content/repositories/dnet5-snapshots/org/antlr/stringtemplate/maven-metadata.xml
[INFO] Downloading: http://maven.research-infrastructures.eu/nexus/content/repositories/dnet5-releases/org/antlr/stringtemplate/maven-metadata.xml
[INFO] Downloading: https://repo.maven.apache.org/maven2/org/antlr/stringtemplate/maven-metadata.xml
[INFO] Downloaded: http://maven.research-infrastructures.eu/nexus/content/repositories/dnet-deps/org/antlr/stringtemplate/maven-metadata.xml (297 B at 3.4 KB/sec)
[INFO] Downloaded: https://repo.maven.apache.org/maven2/org/antlr/stringtemplate/maven-metadata.xml (501 B at 6.3 KB/sec)
[INFO] Downloading: http://maven.research-infrastructures.eu/nexus/content/repositories/dnet45-bootstrap-snapshot/org/apache/cxf/cxf-core/maven-metadata.xml
[INFO] Downloading: http://maven.research-infrastructures.eu/nexus/content/repositories/dnet5-bootstrap-snapshot/org/apache/cxf/cxf-core/maven-metadata.xml
[INFO] Downloading: http://maven.research-infrastructures.eu/nexus/content/repositories/dnet5-bootstrap-release/org/apache/cxf/cxf-core/maven-metadata.xml
[INFO] Downloading: http://maven.research-infrastructures.eu/nexus/content/repositories/dnet45-bootstrap-release/org/apache/cxf/cxf-core/maven-metadata.xml
[INFO] Downloading: http://maven.research-infrastructures.eu/nexus/content/repositories/dnet-deps/org/apache/cxf/cxf-core/maven-metadata.xml
[INFO] Downloading: http://maven.research-infrastructures.eu/nexus/content/repositories/dnet5-snapshots/org/apache/cxf/cxf-core/maven-metadata.xml
[INFO] Downloading: http://maven.research-infrastructures.eu/nexus/content/repositories/dnet5-releases/org/apache/cxf/cxf-core/maven-metadata.xml
[INFO] Downloading: https://repo.maven.apache.org/maven2/org/apache/cxf/cxf-core/maven-metadata.xml
[INFO] Downloaded: https://repo.maven.apache.org/maven2/org/apache/cxf/cxf-core/maven-metadata.xml (2 KB at 16.9 KB/sec)
[INFO] Downloading: http://maven.research-infrastructures.eu/nexus/content/repositories/dnet45-bootstrap-snapshot/org/apache/cxf/cxf-rt-frontend-jaxws/maven-metadata.xml
[INFO] Downloading: http://maven.research-infrastructures.eu/nexus/content/repositories/dnet45-bootstrap-release/org/apache/cxf/cxf-rt-frontend-jaxws/maven-metadata.xml
[INFO] Downloading: http://maven.research-infrastructures.eu/nexus/content/repositories/dnet5-bootstrap-snapshot/org/apache/cxf/cxf-rt-frontend-jaxws/maven-metadata.xml
[INFO] Downloading: http://maven.research-infrastructures.eu/nexus/content/repositories/dnet5-bootstrap-release/org/apache/cxf/cxf-rt-frontend-jaxws/maven-metadata.xml
[INFO] Downloading: http://maven.research-infrastructures.eu/nexus/content/repositories/dnet-deps/org/apache/cxf/cxf-rt-frontend-jaxws/maven-metadata.xml
[INFO] Downloading: http://maven.research-infrastructures.eu/nexus/content/repositories/dnet5-snapshots/org/apache/cxf/cxf-rt-frontend-jaxws/maven-metadata.xml
[INFO] Downloading: http://maven.research-infrastructures.eu/nexus/content/repositories/dnet5-releases/org/apache/cxf/cxf-rt-frontend-jaxws/maven-metadata.xml
[INFO] Downloading: https://repo.maven.apache.org/maven2/org/apache/cxf/cxf-rt-frontend-jaxws/maven-metadata.xml
[INFO] Downloaded: http://maven.research-infrastructures.eu/nexus/content/repositories/dnet-deps/org/apache/cxf/cxf-rt-frontend-jaxws/maven-metadata.xml (468 B at 5.6 KB/sec)
[INFO] Downloaded: https://repo.maven.apache.org/maven2/org/apache/cxf/cxf-rt-frontend-jaxws/maven-metadata.xml (5 KB at 56.3 KB/sec)
[INFO] Downloading: http://maven.research-infrastructures.eu/nexus/content/repositories/dnet45-bootstrap-release/dom4j/dom4j/maven-metadata.xml
[INFO] Downloading: http://maven.research-infrastructures.eu/nexus/content/repositories/dnet45-bootstrap-snapshot/dom4j/dom4j/maven-metadata.xml
[INFO] Downloading: http://maven.research-infrastructures.eu/nexus/content/repositories/dnet5-bootstrap-snapshot/dom4j/dom4j/maven-metadata.xml
[INFO] Downloading: http://maven.research-infrastructures.eu/nexus/content/repositories/dnet5-bootstrap-release/dom4j/dom4j/maven-metadata.xml
[INFO] Downloading: http://maven.research-infrastructures.eu/nexus/content/repositories/dnet-deps/dom4j/dom4j/maven-metadata.xml
[INFO] Downloading: http://maven.research-infrastructures.eu/nexus/content/repositories/dnet5-snapshots/dom4j/dom4j/maven-metadata.xml
[INFO] Downloading: http://maven.research-infrastructures.eu/nexus/content/repositories/dnet5-releases/dom4j/dom4j/maven-metadata.xml
[INFO] Downloading: https://repo.maven.apache.org/maven2/dom4j/dom4j/maven-metadata.xml
[INFO] Downloaded: http://maven.research-infrastructures.eu/nexus/content/repositories/dnet-deps/dom4j/dom4j/maven-metadata.xml (311 B at 4.0 KB/sec)
[INFO] Downloaded: https://repo.maven.apache.org/maven2/dom4j/dom4j/maven-metadata.xml (795 B at 10.1 KB/sec)
[INFO] Downloading: http://maven.research-infrastructures.eu/nexus/content/repositories/dnet45-bootstrap-snapshot/com/ximpleware/vtd-xml/maven-metadata.xml
[INFO] Downloading: http://maven.research-infrastructures.eu/nexus/content/repositories/dnet45-bootstrap-release/com/ximpleware/vtd-xml/maven-metadata.xml
[INFO] Downloading: http://maven.research-infrastructures.eu/nexus/content/repositories/dnet5-bootstrap-snapshot/com/ximpleware/vtd-xml/maven-metadata.xml
[INFO] Downloading: http://maven.research-infrastructures.eu/nexus/content/repositories/dnet5-bootstrap-release/com/ximpleware/vtd-xml/maven-metadata.xml
[INFO] Downloading: http://maven.research-infrastructures.eu/nexus/content/repositories/dnet-deps/com/ximpleware/vtd-xml/maven-metadata.xml
[INFO] Downloading: http://maven.research-infrastructures.eu/nexus/content/repositories/dnet5-snapshots/com/ximpleware/vtd-xml/maven-metadata.xml
[INFO] Downloading: http://maven.research-infrastructures.eu/nexus/content/repositories/dnet5-releases/com/ximpleware/vtd-xml/maven-metadata.xml
[INFO] Downloading: https://repo.maven.apache.org/maven2/com/ximpleware/vtd-xml/maven-metadata.xml
[INFO] Downloaded: http://maven.research-infrastructures.eu/nexus/content/repositories/dnet-deps/com/ximpleware/vtd-xml/maven-metadata.xml (360 B at 4.2 KB/sec)
[INFO] Downloaded: https://repo.maven.apache.org/maven2/com/ximpleware/vtd-xml/maven-metadata.xml (391 B at 4.8 KB/sec)
[INFO] Downloading: http://maven.research-infrastructures.eu/nexus/content/repositories/dnet45-bootstrap-release/joda-time/joda-time/maven-metadata.xml
[INFO] Downloading: http://maven.research-infrastructures.eu/nexus/content/repositories/dnet45-bootstrap-snapshot/joda-time/joda-time/maven-metadata.xml
[INFO] Downloading: http://maven.research-infrastructures.eu/nexus/content/repositories/dnet5-bootstrap-snapshot/joda-time/joda-time/maven-metadata.xml
[INFO] Downloading: http://maven.research-infrastructures.eu/nexus/content/repositories/dnet5-bootstrap-release/joda-time/joda-time/maven-metadata.xml
[INFO] Downloading: http://maven.research-infrastructures.eu/nexus/content/repositories/dnet-deps/joda-time/joda-time/maven-metadata.xml
[INFO] Downloading: http://maven.research-infrastructures.eu/nexus/content/repositories/dnet5-snapshots/joda-time/joda-time/maven-metadata.xml
[INFO] Downloading: http://maven.research-infrastructures.eu/nexus/content/repositories/dnet5-releases/joda-time/joda-time/maven-metadata.xml
[INFO] Downloading: https://repo.maven.apache.org/maven2/joda-time/joda-time/maven-metadata.xml
[INFO] Downloaded: https://repo.maven.apache.org/maven2/joda-time/joda-time/maven-metadata.xml (2 KB at 16.5 KB/sec)
[INFO] Downloading: http://maven.research-infrastructures.eu/nexus/content/repositories/dnet45-bootstrap-snapshot/org/springframework/spring-test/maven-metadata.xml
[INFO] Downloading: http://maven.research-infrastructures.eu/nexus/content/repositories/dnet45-bootstrap-release/org/springframework/spring-test/maven-metadata.xml
[INFO] Downloading: http://maven.research-infrastructures.eu/nexus/content/repositories/dnet5-bootstrap-release/org/springframework/spring-test/maven-metadata.xml
[INFO] Downloading: http://maven.research-infrastructures.eu/nexus/content/repositories/dnet5-bootstrap-snapshot/org/springframework/spring-test/maven-metadata.xml
[INFO] Downloading: http://maven.research-infrastructures.eu/nexus/content/repositories/dnet-deps/org/springframework/spring-test/maven-metadata.xml
[INFO] Downloading: http://maven.research-infrastructures.eu/nexus/content/repositories/dnet5-snapshots/org/springframework/spring-test/maven-metadata.xml
[INFO] Downloading: http://maven.research-infrastructures.eu/nexus/content/repositories/dnet5-releases/org/springframework/spring-test/maven-metadata.xml
[INFO] Downloading: https://repo.maven.apache.org/maven2/org/springframework/spring-test/maven-metadata.xml
[INFO] Downloaded: https://repo.maven.apache.org/maven2/org/springframework/spring-test/maven-metadata.xml (4 KB at 45.3 KB/sec)
[INFO] Downloading: http://maven.research-infrastructures.eu/nexus/content/repositories/dnet45-bootstrap-snapshot/org/mockito/mockito-core/maven-metadata.xml
[INFO] Downloading: http://maven.research-infrastructures.eu/nexus/content/repositories/dnet45-bootstrap-release/org/mockito/mockito-core/maven-metadata.xml
[INFO] Downloading: http://maven.research-infrastructures.eu/nexus/content/repositories/dnet5-bootstrap-snapshot/org/mockito/mockito-core/maven-metadata.xml
[INFO] Downloading: http://maven.research-infrastructures.eu/nexus/content/repositories/dnet5-bootstrap-release/org/mockito/mockito-core/maven-metadata.xml
[INFO] Downloading: http://maven.research-infrastructures.eu/nexus/content/repositories/dnet-deps/org/mockito/mockito-core/maven-metadata.xml
[INFO] Downloading: http://maven.research-infrastructures.eu/nexus/content/repositories/dnet5-snapshots/org/mockito/mockito-core/maven-metadata.xml
[INFO] Downloading: http://maven.research-infrastructures.eu/nexus/content/repositories/dnet5-releases/org/mockito/mockito-core/maven-metadata.xml
[INFO] Downloading: https://repo.maven.apache.org/maven2/org/mockito/mockito-core/maven-metadata.xml
[INFO] Downloaded: http://maven.research-infrastructures.eu/nexus/content/repositories/dnet-deps/org/mockito/mockito-core/maven-metadata.xml (326 B at 4.1 KB/sec)
[INFO] Downloaded: https://repo.maven.apache.org/maven2/org/mockito/mockito-core/maven-metadata.xml (9 KB at 92.2 KB/sec)
[INFO] Downloading: http://maven.research-infrastructures.eu/nexus/content/repositories/dnet5-snapshots/eu/dnetlib/dnet-core-components/2.0.0-SAXONHE-SNAPSHOT/dnet-core-components-2.0.0-SAXONHE-20170920.150800-22.jar
[INFO] Downloaded: http://maven.research-infrastructures.eu/nexus/content/repositories/dnet5-snapshots/eu/dnetlib/dnet-core-components/2.0.0-SAXONHE-SNAPSHOT/dnet-core-components-2.0.0-SAXONHE-20170920.150800-22.jar (488 KB at 462.2 KB/sec)
[INFO] 
[INFO] --- protoc-jar-maven-plugin:1.0.0-SNAPSHOT:run (default) @ dnet-graph-domain ---
[INFO] Protoc version: 2.4.1
protoc-jar: protoc version: 241, detected platform: linux/amd64
[INFO] Protoc command: /tmp/protocjar2678196317105244074/bin/protoc.exe
[INFO] Input directories:
[INFO]     /var/lib/jenkins/workspace/DSL5_dnet-graph-domain-saxonHE/src/main/resources
[INFO] Output targets:
[INFO]     java: /var/lib/jenkins/workspace/DSL5_dnet-graph-domain-saxonHE/src/gen/java (add: main, clean: false, plugin: null, outputOptions: null)
[INFO]     Processing (java): Publication.proto
protoc-jar: executing: [/tmp/protocjar2678196317105244074/bin/protoc.exe, -I/var/lib/jenkins/workspace/DSL5_dnet-graph-domain-saxonHE/src/main/resources/eu/dnetlib/data/proto, --java_out=/var/lib/jenkins/workspace/DSL5_dnet-graph-domain-saxonHE/src/gen/java, /var/lib/jenkins/workspace/DSL5_dnet-graph-domain-saxonHE/src/main/resources/eu/dnetlib/data/proto/Publication.proto]
[INFO]     Processing (java): Person.proto
protoc-jar: executing: [/tmp/protocjar2678196317105244074/bin/protoc.exe, -I/var/lib/jenkins/workspace/DSL5_dnet-graph-domain-saxonHE/src/main/resources/eu/dnetlib/data/proto, --java_out=/var/lib/jenkins/workspace/DSL5_dnet-graph-domain-saxonHE/src/gen/java, /var/lib/jenkins/workspace/DSL5_dnet-graph-domain-saxonHE/src/main/resources/eu/dnetlib/data/proto/Person.proto]
[INFO]     Processing (java): Organization.proto
protoc-jar: executing: [/tmp/protocjar2678196317105244074/bin/protoc.exe, -I/var/lib/jenkins/workspace/DSL5_dnet-graph-domain-saxonHE/src/main/resources/eu/dnetlib/data/proto, --java_out=/var/lib/jenkins/workspace/DSL5_dnet-graph-domain-saxonHE/src/gen/java, /var/lib/jenkins/workspace/DSL5_dnet-graph-domain-saxonHE/src/main/resources/eu/dnetlib/data/proto/Organization.proto]
[INFO]     Processing (java): Project.proto
protoc-jar: executing: [/tmp/protocjar2678196317105244074/bin/protoc.exe, -I/var/lib/jenkins/workspace/DSL5_dnet-graph-domain-saxonHE/src/main/resources/eu/dnetlib/data/proto, --java_out=/var/lib/jenkins/workspace/DSL5_dnet-graph-domain-saxonHE/src/gen/java, /var/lib/jenkins/workspace/DSL5_dnet-graph-domain-saxonHE/src/main/resources/eu/dnetlib/data/proto/Project.proto]
[INFO]     Processing (java): Datasource.proto
protoc-jar: executing: [/tmp/protocjar2678196317105244074/bin/protoc.exe, -I/var/lib/jenkins/workspace/DSL5_dnet-graph-domain-saxonHE/src/main/resources/eu/dnetlib/data/proto, --java_out=/var/lib/jenkins/workspace/DSL5_dnet-graph-domain-saxonHE/src/gen/java, /var/lib/jenkins/workspace/DSL5_dnet-graph-domain-saxonHE/src/main/resources/eu/dnetlib/data/proto/Datasource.proto]
[INFO]     Processing (java): Kind.proto
protoc-jar: executing: [/tmp/protocjar2678196317105244074/bin/protoc.exe, -I/var/lib/jenkins/workspace/DSL5_dnet-graph-domain-saxonHE/src/main/resources/eu/dnetlib/data/proto, --java_out=/var/lib/jenkins/workspace/DSL5_dnet-graph-domain-saxonHE/src/gen/java, /var/lib/jenkins/workspace/DSL5_dnet-graph-domain-saxonHE/src/main/resources/eu/dnetlib/data/proto/Kind.proto]
[INFO]     Processing (java): SpecialTrust.proto
protoc-jar: executing: [/tmp/protocjar2678196317105244074/bin/protoc.exe, -I/var/lib/jenkins/workspace/DSL5_dnet-graph-domain-saxonHE/src/main/resources/eu/dnetlib/data/proto, --java_out=/var/lib/jenkins/workspace/DSL5_dnet-graph-domain-saxonHE/src/gen/java, /var/lib/jenkins/workspace/DSL5_dnet-graph-domain-saxonHE/src/main/resources/eu/dnetlib/data/proto/SpecialTrust.proto]
[INFO]     Processing (java): Type.proto
protoc-jar: executing: [/tmp/protocjar2678196317105244074/bin/protoc.exe, -I/var/lib/jenkins/workspace/DSL5_dnet-graph-domain-saxonHE/src/main/resources/eu/dnetlib/data/proto, --java_out=/var/lib/jenkins/workspace/DSL5_dnet-graph-domain-saxonHE/src/gen/java, /var/lib/jenkins/workspace/DSL5_dnet-graph-domain-saxonHE/src/main/resources/eu/dnetlib/data/proto/Type.proto]
[INFO]     Processing (java): ParticipationRelations.proto
protoc-jar: executing: [/tmp/protocjar2678196317105244074/bin/protoc.exe, -I/var/lib/jenkins/workspace/DSL5_dnet-graph-domain-saxonHE/src/main/resources/eu/dnetlib/data/proto, --java_out=/var/lib/jenkins/workspace/DSL5_dnet-graph-domain-saxonHE/src/gen/java, /var/lib/jenkins/workspace/DSL5_dnet-graph-domain-saxonHE/src/main/resources/eu/dnetlib/data/proto/ParticipationRelations.proto]
[INFO]     Processing (java): DngfParent.proto
protoc-jar: executing: [/tmp/protocjar2678196317105244074/bin/protoc.exe, -I/var/lib/jenkins/workspace/DSL5_dnet-graph-domain-saxonHE/src/main/resources/eu/dnetlib/data/proto, --java_out=/var/lib/jenkins/workspace/DSL5_dnet-graph-domain-saxonHE/src/gen/java, /var/lib/jenkins/workspace/DSL5_dnet-graph-domain-saxonHE/src/main/resources/eu/dnetlib/data/proto/DngfParent.proto]
[INFO]     Processing (java): AuthorshipRelations.proto
protoc-jar: executing: [/tmp/protocjar2678196317105244074/bin/protoc.exe, -I/var/lib/jenkins/workspace/DSL5_dnet-graph-domain-saxonHE/src/main/resources/eu/dnetlib/data/proto, --java_out=/var/lib/jenkins/workspace/DSL5_dnet-graph-domain-saxonHE/src/gen/java, /var/lib/jenkins/workspace/DSL5_dnet-graph-domain-saxonHE/src/main/resources/eu/dnetlib/data/proto/AuthorshipRelations.proto]
[INFO]     Processing (java): FieldType.proto
protoc-jar: executing: [/tmp/protocjar2678196317105244074/bin/protoc.exe, -I/var/lib/jenkins/workspace/DSL5_dnet-graph-domain-saxonHE/src/main/resources/eu/dnetlib/data/proto, --java_out=/var/lib/jenkins/workspace/DSL5_dnet-graph-domain-saxonHE/src/gen/java, /var/lib/jenkins/workspace/DSL5_dnet-graph-domain-saxonHE/src/main/resources/eu/dnetlib/data/proto/FieldType.proto]
[INFO]     Processing (java): Dataset.proto
protoc-jar: executing: [/tmp/protocjar2678196317105244074/bin/protoc.exe, -I/var/lib/jenkins/workspace/DSL5_dnet-graph-domain-saxonHE/src/main/resources/eu/dnetlib/data/proto, --java_out=/var/lib/jenkins/workspace/DSL5_dnet-graph-domain-saxonHE/src/gen/java, /var/lib/jenkins/workspace/DSL5_dnet-graph-domain-saxonHE/src/main/resources/eu/dnetlib/data/proto/Dataset.proto]
[INFO] Adding generated classes to classpath
[INFO] 
[INFO] --- maven-resources-plugin:2.6:resources (default-resources) @ dnet-graph-domain ---
[INFO] Using 'UTF-8' encoding to copy filtered resources.
[INFO] Copying 216 resources
[INFO] 
[INFO] --- maven-compiler-plugin:3.1:compile (default-compile) @ dnet-graph-domain ---
[INFO] Changes detected - recompiling the module!
[INFO] Compiling 49 source files to /var/lib/jenkins/workspace/DSL5_dnet-graph-domain-saxonHE/target/classes
[WARNING] /var/lib/jenkins/workspace/DSL5_dnet-graph-domain-saxonHE/src/main/java/eu/dnetlib/data/index/CloudIndexClientFactory.java: Some input files use or override a deprecated API.
[WARNING] /var/lib/jenkins/workspace/DSL5_dnet-graph-domain-saxonHE/src/main/java/eu/dnetlib/data/index/CloudIndexClientFactory.java: Recompile with -Xlint:deprecation for details.
[WARNING] /var/lib/jenkins/workspace/DSL5_dnet-graph-domain-saxonHE/src/main/java/eu/dnetlib/data/transform/OntologyLoader.java: Some input files use unchecked or unsafe operations.
[WARNING] /var/lib/jenkins/workspace/DSL5_dnet-graph-domain-saxonHE/src/main/java/eu/dnetlib/data/transform/OntologyLoader.java: Recompile with -Xlint:unchecked for details.
[INFO] 
[INFO] --- maven-resources-plugin:2.6:testResources (default-testResources) @ dnet-graph-domain ---
[INFO] Using 'UTF-8' encoding to copy filtered resources.
[INFO] Copying 19 resources
[INFO] 
[INFO] --- maven-compiler-plugin:3.1:testCompile (default-testCompile) @ dnet-graph-domain ---
[INFO] Nothing to compile - all classes are up to date
[INFO] 
[INFO] --- maven-surefire-plugin:2.16:test (default-test) @ dnet-graph-domain ---
[INFO] Surefire report directory: /var/lib/jenkins/workspace/DSL5_dnet-graph-domain-saxonHE/target/surefire-reports

-------------------------------------------------------
 T E S T S
-------------------------------------------------------
Running eu.dnetlib.data.transform.xml.OpenTrialsXsltFunctionsTest
Tests run: 2, Failures: 0, Errors: 0, Skipped: 0, Time elapsed: 0.167 sec - in eu.dnetlib.data.transform.xml.OpenTrialsXsltFunctionsTest
Running eu.dnetlib.data.transform.OntologyLoaderTest
Tests run: 3, Failures: 0, Errors: 0, Skipped: 0, Time elapsed: 0.495 sec - in eu.dnetlib.data.transform.OntologyLoaderTest
Running eu.dnetlib.data.transform.SolrProtoMapperTest
Tests run: 1, Failures: 0, Errors: 0, Skipped: 0, Time elapsed: 0.394 sec - in eu.dnetlib.data.transform.SolrProtoMapperTest
Running eu.dnetlib.data.actionmanager.actions.ActionFactoryTest
Tests run: 5, Failures: 0, Errors: 4, Skipped: 0, Time elapsed: 1.079 sec <<< FAILURE! - in eu.dnetlib.data.actionmanager.actions.ActionFactoryTest
testPublicationInsert(eu.dnetlib.data.actionmanager.actions.ActionFactoryTest)  Time elapsed: 0.469 sec  <<< ERROR!
net.sf.saxon.trans.XPathException: Cannot find a matching 1-argument function named {http://exslt.org/common}node-set(). There is no Saxon extension function with the local name node-set
	at net.sf.saxon.expr.ErrorExpression.evaluateItem(ErrorExpression.java:81)
	at net.sf.saxon.expr.ErrorExpression.iterate(ErrorExpression.java:95)
	at net.sf.saxon.functions.Empty.effectiveBooleanValue(Empty.java:110)
	at net.sf.saxon.expr.instruct.Choose.processLeavingTail(Choose.java:868)
	at net.sf.saxon.expr.instruct.Template.applyLeavingTail(Template.java:239)
	at net.sf.saxon.trans.Mode.applyTemplates(Mode.java:1057)
	at net.sf.saxon.trans.TextOnlyCopyRuleSet.process(TextOnlyCopyRuleSet.java:65)
	at net.sf.saxon.trans.Mode.applyTemplates(Mode.java:1045)
	at net.sf.saxon.Controller.transformDocument(Controller.java:2080)
	at net.sf.saxon.Controller.transform(Controller.java:1903)
	at eu.dnetlib.rmi.data.hadoop.actionmanager.actions.XsltInfoPackageAction.applyXslt(XsltInfoPackageAction.java:81)
	at eu.dnetlib.rmi.data.hadoop.actionmanager.actions.XsltInfoPackageAction.calculateAtomicActions(XsltInfoPackageAction.java:89)
	at eu.dnetlib.rmi.data.hadoop.actionmanager.actions.XsltInfoPackageAction.asAtomicActions(XsltInfoPackageAction.java:63)
	at eu.dnetlib.data.actionmanager.actions.ActionFactoryTest.testPublicationInsert(ActionFactoryTest.java:113)

testDatasetInsert(eu.dnetlib.data.actionmanager.actions.ActionFactoryTest)  Time elapsed: 0.094 sec  <<< ERROR!
net.sf.saxon.trans.XPathException: Cannot find a matching 1-argument function named {http://exslt.org/common}node-set(). There is no Saxon extension function with the local name node-set
	at net.sf.saxon.expr.ErrorExpression.evaluateItem(ErrorExpression.java:81)
	at net.sf.saxon.expr.ErrorExpression.iterate(ErrorExpression.java:95)
	at net.sf.saxon.functions.Empty.effectiveBooleanValue(Empty.java:110)
	at net.sf.saxon.expr.OrExpression.effectiveBooleanValue(OrExpression.java:109)
	at net.sf.saxon.expr.instruct.Choose.processLeavingTail(Choose.java:868)
	at net.sf.saxon.expr.instruct.Template.applyLeavingTail(Template.java:239)
	at net.sf.saxon.trans.Mode.applyTemplates(Mode.java:1057)
	at net.sf.saxon.trans.TextOnlyCopyRuleSet.process(TextOnlyCopyRuleSet.java:65)
	at net.sf.saxon.trans.Mode.applyTemplates(Mode.java:1045)
	at net.sf.saxon.Controller.transformDocument(Controller.java:2080)
	at net.sf.saxon.Controller.transform(Controller.java:1903)
	at eu.dnetlib.rmi.data.hadoop.actionmanager.actions.XsltInfoPackageAction.applyXslt(XsltInfoPackageAction.java:81)
	at eu.dnetlib.rmi.data.hadoop.actionmanager.actions.XsltInfoPackageAction.calculateAtomicActions(XsltInfoPackageAction.java:89)
	at eu.dnetlib.rmi.data.hadoop.actionmanager.actions.XsltInfoPackageAction.asAtomicActions(XsltInfoPackageAction.java:63)
	at eu.dnetlib.data.actionmanager.actions.ActionFactoryTest.testDatasetInsert(ActionFactoryTest.java:93)

testPublicationUpdate(eu.dnetlib.data.actionmanager.actions.ActionFactoryTest)  Time elapsed: 0.026 sec  <<< ERROR!
net.sf.saxon.trans.XPathException: Cannot find a matching 1-argument function named {http://exslt.org/common}node-set(). There is no Saxon extension function with the local name node-set
	at net.sf.saxon.expr.ErrorExpression.evaluateItem(ErrorExpression.java:81)
	at net.sf.saxon.expr.ErrorExpression.iterate(ErrorExpression.java:95)
	at net.sf.saxon.functions.Empty.effectiveBooleanValue(Empty.java:110)
	at net.sf.saxon.expr.instruct.Choose.processLeavingTail(Choose.java:868)
	at net.sf.saxon.expr.instruct.Template.applyLeavingTail(Template.java:239)
	at net.sf.saxon.trans.Mode.applyTemplates(Mode.java:1057)
	at net.sf.saxon.trans.TextOnlyCopyRuleSet.process(TextOnlyCopyRuleSet.java:65)
	at net.sf.saxon.trans.Mode.applyTemplates(Mode.java:1045)
	at net.sf.saxon.Controller.transformDocument(Controller.java:2080)
	at net.sf.saxon.Controller.transform(Controller.java:1903)
	at eu.dnetlib.rmi.data.hadoop.actionmanager.actions.XsltInfoPackageAction.applyXslt(XsltInfoPackageAction.java:81)
	at eu.dnetlib.rmi.data.hadoop.actionmanager.actions.XsltInfoPackageAction.calculateAtomicActions(XsltInfoPackageAction.java:89)
	at eu.dnetlib.rmi.data.hadoop.actionmanager.actions.XsltInfoPackageAction.asAtomicActions(XsltInfoPackageAction.java:63)
	at eu.dnetlib.data.actionmanager.actions.ActionFactoryTest.testPublicationUpdate(ActionFactoryTest.java:122)

testDatasetUpdate(eu.dnetlib.data.actionmanager.actions.ActionFactoryTest)  Time elapsed: 0.03 sec  <<< ERROR!
net.sf.saxon.trans.XPathException: Cannot find a matching 1-argument function named {http://exslt.org/common}node-set(). There is no Saxon extension function with the local name node-set
	at net.sf.saxon.expr.ErrorExpression.evaluateItem(ErrorExpression.java:81)
	at net.sf.saxon.expr.ErrorExpression.iterate(ErrorExpression.java:95)
	at net.sf.saxon.functions.Empty.effectiveBooleanValue(Empty.java:110)
	at net.sf.saxon.expr.instruct.Choose.processLeavingTail(Choose.java:868)
	at net.sf.saxon.expr.instruct.Template.applyLeavingTail(Template.java:239)
	at net.sf.saxon.trans.Mode.applyTemplates(Mode.java:1057)
	at net.sf.saxon.trans.TextOnlyCopyRuleSet.process(TextOnlyCopyRuleSet.java:65)
	at net.sf.saxon.trans.Mode.applyTemplates(Mode.java:1045)
	at net.sf.saxon.Controller.transformDocument(Controller.java:2080)
	at net.sf.saxon.Controller.transform(Controller.java:1903)
	at eu.dnetlib.rmi.data.hadoop.actionmanager.actions.XsltInfoPackageAction.applyXslt(XsltInfoPackageAction.java:81)
	at eu.dnetlib.rmi.data.hadoop.actionmanager.actions.XsltInfoPackageAction.calculateAtomicActions(XsltInfoPackageAction.java:89)
	at eu.dnetlib.rmi.data.hadoop.actionmanager.actions.XsltInfoPackageAction.asAtomicActions(XsltInfoPackageAction.java:63)
	at eu.dnetlib.data.actionmanager.actions.ActionFactoryTest.testDatasetUpdate(ActionFactoryTest.java:103)

Running eu.dnetlib.data.graph.utils.RelDescriptorTest
Tests run: 4, Failures: 0, Errors: 0, Skipped: 0, Time elapsed: 0.001 sec - in eu.dnetlib.data.graph.utils.RelDescriptorTest
Running eu.dnetlib.data.mapreduce.util.DNGFDecoderTest
Tests run: 2, Failures: 0, Errors: 0, Skipped: 0, Time elapsed: 0.003 sec - in eu.dnetlib.data.mapreduce.util.DNGFDecoderTest
Running eu.dnetlib.data.mapreduce.util.DNGFRowKeyDecoderTest
Tests run: 1, Failures: 0, Errors: 0, Skipped: 0, Time elapsed: 0.001 sec - in eu.dnetlib.data.mapreduce.util.DNGFRowKeyDecoderTest
Running eu.dnetlib.data.mapreduce.util.DNGFRelDecoderTest
Tests run: 1, Failures: 0, Errors: 0, Skipped: 1, Time elapsed: 0 sec - in eu.dnetlib.data.mapreduce.util.DNGFRelDecoderTest
Running eu.dnetlib.pace.distance.DetectorTest
Tests run: 25, Failures: 0, Errors: 0, Skipped: 0, Time elapsed: 0.272 sec - in eu.dnetlib.pace.distance.DetectorTest
Running eu.dnetlib.pace.model.gt.AuthorTest
Tests run: 2, Failures: 0, Errors: 0, Skipped: 0, Time elapsed: 0.002 sec - in eu.dnetlib.pace.model.gt.AuthorTest
Running eu.dnetlib.pace.model.ProtoDocumentBuilderTest
Tests run: 3, Failures: 0, Errors: 0, Skipped: 0, Time elapsed: 0.028 sec - in eu.dnetlib.pace.model.ProtoDocumentBuilderTest
Running eu.dnetlib.pace.clustering.BlacklistAwareClusteringCombinerTest
Tests run: 1, Failures: 0, Errors: 0, Skipped: 0, Time elapsed: 0.006 sec - in eu.dnetlib.pace.clustering.BlacklistAwareClusteringCombinerTest
Running eu.dnetlib.pace.clustering.ClusteringCombinerTest
Tests run: 1, Failures: 0, Errors: 0, Skipped: 0, Time elapsed: 0.003 sec - in eu.dnetlib.pace.clustering.ClusteringCombinerTest

Results :

Tests in error: 
  ActionFactoryTest.testPublicationInsert:113 » XPath Cannot find a matching 1-a...
  ActionFactoryTest.testDatasetInsert:93 » XPath Cannot find a matching 1-argume...
  ActionFactoryTest.testPublicationUpdate:122 » XPath Cannot find a matching 1-a...
  ActionFactoryTest.testDatasetUpdate:103 » XPath Cannot find a matching 1-argum...

Tests run: 51, Failures: 0, Errors: 4, Skipped: 1

[ERROR] There are test failures.

Please refer to /var/lib/jenkins/workspace/DSL5_dnet-graph-domain-saxonHE/target/surefire-reports for the individual test results.
[JENKINS] Recording test results
[INFO] 
[INFO] --- maven-jar-plugin:2.4:jar (default-jar) @ dnet-graph-domain ---
[INFO] Building jar: /var/lib/jenkins/workspace/DSL5_dnet-graph-domain-saxonHE/target/dnet-graph-domain-1.0.0-SAXONHE-SNAPSHOT.jar
[INFO] 
[INFO] >>> maven-source-plugin:2.2.1:jar (default-cli) > generate-sources @ dnet-graph-domain >>>
[INFO] 
[INFO] --- protoc-jar-maven-plugin:1.0.0-SNAPSHOT:run (default) @ dnet-graph-domain ---
[INFO] Protoc version: 2.4.1
protoc-jar: protoc version: 241, detected platform: linux/amd64
[INFO] Protoc command: /tmp/protocjar7878230431185160499/bin/protoc.exe
[INFO] Input directories:
[INFO]     /var/lib/jenkins/workspace/DSL5_dnet-graph-domain-saxonHE/src/main/resources
[INFO] Output targets:
[INFO]     java: /var/lib/jenkins/workspace/DSL5_dnet-graph-domain-saxonHE/src/gen/java (add: main, clean: false, plugin: null, outputOptions: null)
[INFO]     Processing (java): Publication.proto
protoc-jar: executing: [/tmp/protocjar7878230431185160499/bin/protoc.exe, -I/var/lib/jenkins/workspace/DSL5_dnet-graph-domain-saxonHE/src/main/resources/eu/dnetlib/data/proto, --java_out=/var/lib/jenkins/workspace/DSL5_dnet-graph-domain-saxonHE/src/gen/java, /var/lib/jenkins/workspace/DSL5_dnet-graph-domain-saxonHE/src/main/resources/eu/dnetlib/data/proto/Publication.proto]
[INFO]     Processing (java): Person.proto
protoc-jar: executing: [/tmp/protocjar7878230431185160499/bin/protoc.exe, -I/var/lib/jenkins/workspace/DSL5_dnet-graph-domain-saxonHE/src/main/resources/eu/dnetlib/data/proto, --java_out=/var/lib/jenkins/workspace/DSL5_dnet-graph-domain-saxonHE/src/gen/java, /var/lib/jenkins/workspace/DSL5_dnet-graph-domain-saxonHE/src/main/resources/eu/dnetlib/data/proto/Person.proto]
[INFO]     Processing (java): Organization.proto
protoc-jar: executing: [/tmp/protocjar7878230431185160499/bin/protoc.exe, -I/var/lib/jenkins/workspace/DSL5_dnet-graph-domain-saxonHE/src/main/resources/eu/dnetlib/data/proto, --java_out=/var/lib/jenkins/workspace/DSL5_dnet-graph-domain-saxonHE/src/gen/java, /var/lib/jenkins/workspace/DSL5_dnet-graph-domain-saxonHE/src/main/resources/eu/dnetlib/data/proto/Organization.proto]
[INFO]     Processing (java): Project.proto
protoc-jar: executing: [/tmp/protocjar7878230431185160499/bin/protoc.exe, -I/var/lib/jenkins/workspace/DSL5_dnet-graph-domain-saxonHE/src/main/resources/eu/dnetlib/data/proto, --java_out=/var/lib/jenkins/workspace/DSL5_dnet-graph-domain-saxonHE/src/gen/java, /var/lib/jenkins/workspace/DSL5_dnet-graph-domain-saxonHE/src/main/resources/eu/dnetlib/data/proto/Project.proto]
[INFO]     Processing (java): Datasource.proto
protoc-jar: executing: [/tmp/protocjar7878230431185160499/bin/protoc.exe, -I/var/lib/jenkins/workspace/DSL5_dnet-graph-domain-saxonHE/src/main/resources/eu/dnetlib/data/proto, --java_out=/var/lib/jenkins/workspace/DSL5_dnet-graph-domain-saxonHE/src/gen/java, /var/lib/jenkins/workspace/DSL5_dnet-graph-domain-saxonHE/src/main/resources/eu/dnetlib/data/proto/Datasource.proto]
[INFO]     Processing (java): Kind.proto
protoc-jar: executing: [/tmp/protocjar7878230431185160499/bin/protoc.exe, -I/var/lib/jenkins/workspace/DSL5_dnet-graph-domain-saxonHE/src/main/resources/eu/dnetlib/data/proto, --java_out=/var/lib/jenkins/workspace/DSL5_dnet-graph-domain-saxonHE/src/gen/java, /var/lib/jenkins/workspace/DSL5_dnet-graph-domain-saxonHE/src/main/resources/eu/dnetlib/data/proto/Kind.proto]
[INFO]     Processing (java): SpecialTrust.proto
protoc-jar: executing: [/tmp/protocjar7878230431185160499/bin/protoc.exe, -I/var/lib/jenkins/workspace/DSL5_dnet-graph-domain-saxonHE/src/main/resources/eu/dnetlib/data/proto, --java_out=/var/lib/jenkins/workspace/DSL5_dnet-graph-domain-saxonHE/src/gen/java, /var/lib/jenkins/workspace/DSL5_dnet-graph-domain-saxonHE/src/main/resources/eu/dnetlib/data/proto/SpecialTrust.proto]
[INFO]     Processing (java): Type.proto
protoc-jar: executing: [/tmp/protocjar7878230431185160499/bin/protoc.exe, -I/var/lib/jenkins/workspace/DSL5_dnet-graph-domain-saxonHE/src/main/resources/eu/dnetlib/data/proto, --java_out=/var/lib/jenkins/workspace/DSL5_dnet-graph-domain-saxonHE/src/gen/java, /var/lib/jenkins/workspace/DSL5_dnet-graph-domain-saxonHE/src/main/resources/eu/dnetlib/data/proto/Type.proto]
[INFO]     Processing (java): ParticipationRelations.proto
protoc-jar: executing: [/tmp/protocjar7878230431185160499/bin/protoc.exe, -I/var/lib/jenkins/workspace/DSL5_dnet-graph-domain-saxonHE/src/main/resources/eu/dnetlib/data/proto, --java_out=/var/lib/jenkins/workspace/DSL5_dnet-graph-domain-saxonHE/src/gen/java, /var/lib/jenkins/workspace/DSL5_dnet-graph-domain-saxonHE/src/main/resources/eu/dnetlib/data/proto/ParticipationRelations.proto]
[INFO]     Processing (java): DngfParent.proto
protoc-jar: executing: [/tmp/protocjar7878230431185160499/bin/protoc.exe, -I/var/lib/jenkins/workspace/DSL5_dnet-graph-domain-saxonHE/src/main/resources/eu/dnetlib/data/proto, --java_out=/var/lib/jenkins/workspace/DSL5_dnet-graph-domain-saxonHE/src/gen/java, /var/lib/jenkins/workspace/DSL5_dnet-graph-domain-saxonHE/src/main/resources/eu/dnetlib/data/proto/DngfParent.proto]
[INFO]     Processing (java): AuthorshipRelations.proto
protoc-jar: executing: [/tmp/protocjar7878230431185160499/bin/protoc.exe, -I/var/lib/jenkins/workspace/DSL5_dnet-graph-domain-saxonHE/src/main/resources/eu/dnetlib/data/proto, --java_out=/var/lib/jenkins/workspace/DSL5_dnet-graph-domain-saxonHE/src/gen/java, /var/lib/jenkins/workspace/DSL5_dnet-graph-domain-saxonHE/src/main/resources/eu/dnetlib/data/proto/AuthorshipRelations.proto]
[INFO]     Processing (java): FieldType.proto
protoc-jar: executing: [/tmp/protocjar7878230431185160499/bin/protoc.exe, -I/var/lib/jenkins/workspace/DSL5_dnet-graph-domain-saxonHE/src/main/resources/eu/dnetlib/data/proto, --java_out=/var/lib/jenkins/workspace/DSL5_dnet-graph-domain-saxonHE/src/gen/java, /var/lib/jenkins/workspace/DSL5_dnet-graph-domain-saxonHE/src/main/resources/eu/dnetlib/data/proto/FieldType.proto]
[INFO]     Processing (java): Dataset.proto
protoc-jar: executing: [/tmp/protocjar7878230431185160499/bin/protoc.exe, -I/var/lib/jenkins/workspace/DSL5_dnet-graph-domain-saxonHE/src/main/resources/eu/dnetlib/data/proto, --java_out=/var/lib/jenkins/workspace/DSL5_dnet-graph-domain-saxonHE/src/gen/java, /var/lib/jenkins/workspace/DSL5_dnet-graph-domain-saxonHE/src/main/resources/eu/dnetlib/data/proto/Dataset.proto]
[INFO] Adding generated classes to classpath
[WARNING] Failed to getClass for org.apache.maven.plugin.source.SourceJarMojo
[INFO] 
[INFO] <<< maven-source-plugin:2.2.1:jar (default-cli) < generate-sources @ dnet-graph-domain <<<
[INFO] 
[INFO] --- maven-source-plugin:2.2.1:jar (default-cli) @ dnet-graph-domain ---
[INFO] Building jar: /var/lib/jenkins/workspace/DSL5_dnet-graph-domain-saxonHE/target/dnet-graph-domain-1.0.0-SAXONHE-SNAPSHOT-sources.jar
Started calculate disk usage of build
Finished Calculation of disk usage of build in 0 seconds
Started calculate disk usage of workspace
Finished Calculation of disk usage of workspace in 0 seconds
[INFO] ------------------------------------------------------------------------
[INFO] BUILD SUCCESS
[INFO] ------------------------------------------------------------------------
[INFO] Total time: 31.025 s
[INFO] Finished at: 2017-09-20T17:09:08+02:00
[INFO] Final Memory: 36M/427M
[INFO] ------------------------------------------------------------------------
[JENKINS] Archiving /var/lib/jenkins/workspace/DSL5_dnet-graph-domain-saxonHE/pom.xml to eu.dnetlib/dnet-graph-domain/1.0.0-SAXONHE-SNAPSHOT/dnet-graph-domain-1.0.0-SAXONHE-SNAPSHOT.pom
[JENKINS] Archiving /var/lib/jenkins/workspace/DSL5_dnet-graph-domain-saxonHE/target/dnet-graph-domain-1.0.0-SAXONHE-SNAPSHOT.jar to eu.dnetlib/dnet-graph-domain/1.0.0-SAXONHE-SNAPSHOT/dnet-graph-domain-1.0.0-SAXONHE-SNAPSHOT.jar
[JENKINS] Archiving /var/lib/jenkins/workspace/DSL5_dnet-graph-domain-saxonHE/target/dnet-graph-domain-1.0.0-SAXONHE-SNAPSHOT-sources.jar to eu.dnetlib/dnet-graph-domain/1.0.0-SAXONHE-SNAPSHOT/dnet-graph-domain-1.0.0-SAXONHE-SNAPSHOT-sources.jar
channel stopped
Maven RedeployPublisher use remote ip-90-147-167-168.ct1.garrservices.it maven settings from : /var/lib/jenkins/.m2/settings.xml
[INFO] Deployment in http://maven.research-infrastructures.eu/nexus/content/repositories/dnet5-snapshots (id=dnet5-snapshots,uniqueVersion=true)
Deploying the main artifact dnet-graph-domain-1.0.0-SAXONHE-SNAPSHOT.jar
Downloading: http://maven.research-infrastructures.eu/nexus/content/repositories/dnet5-snapshots/eu/dnetlib/dnet-graph-domain/1.0.0-SAXONHE-SNAPSHOT/maven-metadata.xml
Downloaded: http://maven.research-infrastructures.eu/nexus/content/repositories/dnet5-snapshots/eu/dnetlib/dnet-graph-domain/1.0.0-SAXONHE-SNAPSHOT/maven-metadata.xml (2 KB at 0.0 KB/sec)
Uploading: http://maven.research-infrastructures.eu/nexus/content/repositories/dnet5-snapshots/eu/dnetlib/dnet-graph-domain/1.0.0-SAXONHE-SNAPSHOT/dnet-graph-domain-1.0.0-SAXONHE-20170920.150933-20.jar
Uploaded: http://maven.research-infrastructures.eu/nexus/content/repositories/dnet5-snapshots/eu/dnetlib/dnet-graph-domain/1.0.0-SAXONHE-SNAPSHOT/dnet-graph-domain-1.0.0-SAXONHE-20170920.150933-20.jar (926 KB at 280.5 KB/sec)
Uploading: http://maven.research-infrastructures.eu/nexus/content/repositories/dnet5-snapshots/eu/dnetlib/dnet-graph-domain/1.0.0-SAXONHE-SNAPSHOT/dnet-graph-domain-1.0.0-SAXONHE-20170920.150933-20.pom
Uploaded: http://maven.research-infrastructures.eu/nexus/content/repositories/dnet5-snapshots/eu/dnetlib/dnet-graph-domain/1.0.0-SAXONHE-SNAPSHOT/dnet-graph-domain-1.0.0-SAXONHE-20170920.150933-20.pom (5 KB at 14.3 KB/sec)
Downloading: http://maven.research-infrastructures.eu/nexus/content/repositories/dnet5-snapshots/eu/dnetlib/dnet-graph-domain/maven-metadata.xml
Downloaded: http://maven.research-infrastructures.eu/nexus/content/repositories/dnet5-snapshots/eu/dnetlib/dnet-graph-domain/maven-metadata.xml (335 B at 0.0 KB/sec)
Uploading: http://maven.research-infrastructures.eu/nexus/content/repositories/dnet5-snapshots/eu/dnetlib/dnet-graph-domain/1.0.0-SAXONHE-SNAPSHOT/maven-metadata.xml
Uploaded: http://maven.research-infrastructures.eu/nexus/content/repositories/dnet5-snapshots/eu/dnetlib/dnet-graph-domain/1.0.0-SAXONHE-SNAPSHOT/maven-metadata.xml (2 KB at 0.0 KB/sec)
Uploading: http://maven.research-infrastructures.eu/nexus/content/repositories/dnet5-snapshots/eu/dnetlib/dnet-graph-domain/maven-metadata.xml
Uploaded: http://maven.research-infrastructures.eu/nexus/content/repositories/dnet5-snapshots/eu/dnetlib/dnet-graph-domain/maven-metadata.xml (335 B at 0.0 KB/sec)
Deploying the main artifact dnet-graph-domain-1.0.0-SAXONHE-SNAPSHOT-sources.jar
Uploading: http://maven.research-infrastructures.eu/nexus/content/repositories/dnet5-snapshots/eu/dnetlib/dnet-graph-domain/1.0.0-SAXONHE-SNAPSHOT/dnet-graph-domain-1.0.0-SAXONHE-20170920.150933-20-sources.jar
Uploaded: http://maven.research-infrastructures.eu/nexus/content/repositories/dnet5-snapshots/eu/dnetlib/dnet-graph-domain/1.0.0-SAXONHE-SNAPSHOT/dnet-graph-domain-1.0.0-SAXONHE-20170920.150933-20-sources.jar (547 KB at 2071.3 KB/sec)
Uploading: http://maven.research-infrastructures.eu/nexus/content/repositories/dnet5-snapshots/eu/dnetlib/dnet-graph-domain/1.0.0-SAXONHE-SNAPSHOT/maven-metadata.xml
Uploaded: http://maven.research-infrastructures.eu/nexus/content/repositories/dnet5-snapshots/eu/dnetlib/dnet-graph-domain/1.0.0-SAXONHE-SNAPSHOT/maven-metadata.xml (2 KB at 0.0 KB/sec)
[INFO] Deployment done in 2 min 23 sec
Started calculate disk usage of build
Finished Calculation of disk usage of build in 0 seconds
Started calculate disk usage of workspace
Finished Calculation of disk usage of workspace in 0 seconds
Finished: UNSTABLE